Build failed in Jenkins: cubicweb-saem_ref » py27,debian_jessie #156

jenkins.logilab.org noreply at logilab.org
Mon Mar 20 15:21:21 CET 2017


https://jenkins.logilab.org/job/cubicweb-saem_ref/TOXENV=py27,distributions=debian_jessie/156/------------------------------------------
[...truncated 79.57 KB...]
.tox/py27/local/lib/python2.7/site-packages/cubicweb/devtools/__init__.py:793: in init_test_database
    init_config=self.init_config)
.tox/py27/local/lib/python2.7/site-packages/cubicweb/server/__init__.py:218: in init_repository
    repo.bootstrap()
.tox/py27/local/lib/python2.7/site-packages/cubicweb/server/repository.py:276: in bootstrap
    self.set_schema(config.load_schema(expand_cubes=True))
.tox/py27/local/lib/python2.7/site-packages/cubicweb/server/repository.py:362: in set_schema
    self.vreg.set_schema(schema)
.tox/py27/local/lib/python2.7/site-packages/cubicweb/cwvreg.py:420: in set_schema
    self.reload(self.config.appobjects_modnames(), force_reload=False)
.tox/py27/local/lib/python2.7/site-packages/cubicweb/cwvreg.py:485: in reload
    self.register_modnames(modnames)
.tox/py27/local/lib/python2.7/site-packages/logilab/common/registry.py:713: in register_modnames
    self.load_file(filepath, modname)
.tox/py27/local/lib/python2.7/site-packages/cubicweb/cwvreg.py:495: in load_file
    return super(CWRegistryStore, self).load_file(filepath, modname)
.tox/py27/local/lib/python2.7/site-packages/logilab/common/registry.py:772: in load_file
    self.load_module(module)
.tox/py27/local/lib/python2.7/site-packages/logilab/common/registry.py:795: in load_module
    module.registration_callback(self)
_ _ _ _ _ _ _ _ _ _ _ _ _ _ _ _ _ _ _ _ _ _ _ _ _ _ _ _ _ _ _ _ _ _ _ _ _ _ _ _ 

vreg = {'adapters': {'IRecordable': [<class 'cubes.prov.entities.IRecordable'>], 'EAC...lation': [<class 'cubicweb.hooks.security.BeforeDeleteRelationSecurityHook'>]}}

    def registration_callback(vreg):
        vreg.register_all(globals().values(), __name__)
        vreg.register(IContainer.build_class('SEDAArchiveTransfer'))
        vreg.register(IContainer.build_class('SEDAArchiveUnit'))  # archive unit may also be a container
        for etype, parent_relations in sorted(seda_profile_container_def(vreg.schema)):
            cls = DirectLinkIContained.build_class(etype, parent_relations)
>           assert cls
E           AssertionError

.tox/py27/local/lib/python2.7/site-packages/cubicweb_seda/entities/__init__.py:202: AssertionError
__________________________ AuthorityRecordTC.test_fti __________________________
.tox/py27/local/lib/python2.7/site-packages/cubicweb/devtools/testlib.py:418: in setUp
    self._init_repo()
.tox/py27/local/lib/python2.7/site-packages/cubicweb/devtools/testlib.py:347: in _init_repo
    db_handler.build_db_cache(self.test_db_id, self.pre_setup_database)
.tox/py27/local/lib/python2.7/site-packages/cubicweb/devtools/__init__.py:475: in build_db_cache
    self.init_test_database()
.tox/py27/local/lib/python2.7/site-packages/cubicweb/devtools/__init__.py:793: in init_test_database
    init_config=self.init_config)
.tox/py27/local/lib/python2.7/site-packages/cubicweb/server/__init__.py:218: in init_repository
    repo.bootstrap()
.tox/py27/local/lib/python2.7/site-packages/cubicweb/server/repository.py:276: in bootstrap
    self.set_schema(config.load_schema(expand_cubes=True))
.tox/py27/local/lib/python2.7/site-packages/cubicweb/server/repository.py:362: in set_schema
    self.vreg.set_schema(schema)
.tox/py27/local/lib/python2.7/site-packages/cubicweb/cwvreg.py:420: in set_schema
    self.reload(self.config.appobjects_modnames(), force_reload=False)
.tox/py27/local/lib/python2.7/site-packages/cubicweb/cwvreg.py:485: in reload
    self.register_modnames(modnames)
.tox/py27/local/lib/python2.7/site-packages/logilab/common/registry.py:713: in register_modnames
    self.load_file(filepath, modname)
.tox/py27/local/lib/python2.7/site-packages/cubicweb/cwvreg.py:495: in load_file
    return super(CWRegistryStore, self).load_file(filepath, modname)
.tox/py27/local/lib/python2.7/site-packages/logilab/common/registry.py:772: in load_file
    self.load_module(module)
.tox/py27/local/lib/python2.7/site-packages/logilab/common/registry.py:795: in load_module
    module.registration_callback(self)
_ _ _ _ _ _ _ _ _ _ _ _ _ _ _ _ _ _ _ _ _ _ _ _ _ _ _ _ _ _ _ _ _ _ _ _ _ _ _ _ 

vreg = {'adapters': {'IRecordable': [<class 'cubes.prov.entities.IRecordable'>], 'EAC...lation': [<class 'cubicweb.hooks.security.BeforeDeleteRelationSecurityHook'>]}}

    def registration_callback(vreg):
        vreg.register_all(globals().values(), __name__)
        vreg.register(IContainer.build_class('SEDAArchiveTransfer'))
        vreg.register(IContainer.build_class('SEDAArchiveUnit'))  # archive unit may also be a container
        for etype, parent_relations in sorted(seda_profile_container_def(vreg.schema)):
            cls = DirectLinkIContained.build_class(etype, parent_relations)
>           assert cls
E           AssertionError

.tox/py27/local/lib/python2.7/site-packages/cubicweb_seda/entities/__init__.py:202: AssertionError
_____________________ ConceptSchemeTC.test_graph_structure _____________________
.tox/py27/local/lib/python2.7/site-packages/cubicweb/devtools/testlib.py:418: in setUp
    self._init_repo()
.tox/py27/local/lib/python2.7/site-packages/cubicweb/devtools/testlib.py:347: in _init_repo
    db_handler.build_db_cache(self.test_db_id, self.pre_setup_database)
.tox/py27/local/lib/python2.7/site-packages/cubicweb/devtools/__init__.py:475: in build_db_cache
    self.init_test_database()
.tox/py27/local/lib/python2.7/site-packages/cubicweb/devtools/__init__.py:793: in init_test_database
    init_config=self.init_config)
.tox/py27/local/lib/python2.7/site-packages/cubicweb/server/__init__.py:218: in init_repository
    repo.bootstrap()
.tox/py27/local/lib/python2.7/site-packages/cubicweb/server/repository.py:276: in bootstrap
    self.set_schema(config.load_schema(expand_cubes=True))
.tox/py27/local/lib/python2.7/site-packages/cubicweb/server/repository.py:362: in set_schema
    self.vreg.set_schema(schema)
.tox/py27/local/lib/python2.7/site-packages/cubicweb/cwvreg.py:420: in set_schema
    self.reload(self.config.appobjects_modnames(), force_reload=False)
.tox/py27/local/lib/python2.7/site-packages/cubicweb/cwvreg.py:485: in reload
    self.register_modnames(modnames)
.tox/py27/local/lib/python2.7/site-packages/logilab/common/registry.py:713: in register_modnames
    self.load_file(filepath, modname)
.tox/py27/local/lib/python2.7/site-packages/cubicweb/cwvreg.py:495: in load_file
    return super(CWRegistryStore, self).load_file(filepath, modname)
.tox/py27/local/lib/python2.7/site-packages/logilab/common/registry.py:772: in load_file
    self.load_module(module)
.tox/py27/local/lib/python2.7/site-packages/logilab/common/registry.py:795: in load_module
    module.registration_callback(self)
_ _ _ _ _ _ _ _ _ _ _ _ _ _ _ _ _ _ _ _ _ _ _ _ _ _ _ _ _ _ _ _ _ _ _ _ _ _ _ _ 

vreg = {'adapters': {'IRecordable': [<class 'cubes.prov.entities.IRecordable'>], 'EAC...lation': [<class 'cubicweb.hooks.security.BeforeDeleteRelationSecurityHook'>]}}

    def registration_callback(vreg):
        vreg.register_all(globals().values(), __name__)
        vreg.register(IContainer.build_class('SEDAArchiveTransfer'))
        vreg.register(IContainer.build_class('SEDAArchiveUnit'))  # archive unit may also be a container
        for etype, parent_relations in sorted(seda_profile_container_def(vreg.schema)):
            cls = DirectLinkIContained.build_class(etype, parent_relations)
>           assert cls
E           AssertionError

.tox/py27/local/lib/python2.7/site-packages/cubicweb_seda/entities/__init__.py:202: AssertionError
__________________________ SecurityTC.test_agent_user __________________________
.tox/py27/local/lib/python2.7/site-packages/cubicweb/devtools/testlib.py:418: in setUp
    self._init_repo()
.tox/py27/local/lib/python2.7/site-packages/cubicweb/devtools/testlib.py:347: in _init_repo
    db_handler.build_db_cache(self.test_db_id, self.pre_setup_database)
.tox/py27/local/lib/python2.7/site-packages/cubicweb/devtools/__init__.py:475: in build_db_cache
    self.init_test_database()
.tox/py27/local/lib/python2.7/site-packages/cubicweb/devtools/__init__.py:793: in init_test_database
    init_config=self.init_config)
.tox/py27/local/lib/python2.7/site-packages/cubicweb/server/__init__.py:218: in init_repository
    repo.bootstrap()
.tox/py27/local/lib/python2.7/site-packages/cubicweb/server/repository.py:276: in bootstrap
    self.set_schema(config.load_schema(expand_cubes=True))
.tox/py27/local/lib/python2.7/site-packages/cubicweb/server/repository.py:362: in set_schema
    self.vreg.set_schema(schema)
.tox/py27/local/lib/python2.7/site-packages/cubicweb/cwvreg.py:420: in set_schema
    self.reload(self.config.appobjects_modnames(), force_reload=False)
.tox/py27/local/lib/python2.7/site-packages/cubicweb/cwvreg.py:485: in reload
    self.register_modnames(modnames)
.tox/py27/local/lib/python2.7/site-packages/logilab/common/registry.py:713: in register_modnames
    self.load_file(filepath, modname)
.tox/py27/local/lib/python2.7/site-packages/cubicweb/cwvreg.py:495: in load_file
    return super(CWRegistryStore, self).load_file(filepath, modname)
.tox/py27/local/lib/python2.7/site-packages/logilab/common/registry.py:772: in load_file
    self.load_module(module)
.tox/py27/local/lib/python2.7/site-packages/logilab/common/registry.py:795: in load_module
    module.registration_callback(self)
_ _ _ _ _ _ _ _ _ _ _ _ _ _ _ _ _ _ _ _ _ _ _ _ _ _ _ _ _ _ _ _ _ _ _ _ _ _ _ _ 

vreg = {'adapters': {'IRecordable': [<class 'cubes.prov.entities.IRecordable'>], 'EAC...lation': [<class 'cubicweb.hooks.security.BeforeDeleteRelationSecurityHook'>]}}

    def registration_callback(vreg):
        vreg.register_all(globals().values(), __name__)
        vreg.register(IContainer.build_class('SEDAArchiveTransfer'))
        vreg.register(IContainer.build_class('SEDAArchiveUnit'))  # archive unit may also be a container
        for etype, parent_relations in sorted(seda_profile_container_def(vreg.schema)):
            cls = DirectLinkIContained.build_class(etype, parent_relations)
>           assert cls
E           AssertionError

.tox/py27/local/lib/python2.7/site-packages/cubicweb_seda/entities/__init__.py:202: AssertionError
______________________ SKOSImportTC.test_datafeed_source _______________________
.tox/py27/local/lib/python2.7/site-packages/cubicweb/devtools/testlib.py:418: in setUp
    self._init_repo()
.tox/py27/local/lib/python2.7/site-packages/cubicweb/devtools/testlib.py:347: in _init_repo
    db_handler.build_db_cache(self.test_db_id, self.pre_setup_database)
.tox/py27/local/lib/python2.7/site-packages/cubicweb/devtools/__init__.py:475: in build_db_cache
    self.init_test_database()
.tox/py27/local/lib/python2.7/site-packages/cubicweb/devtools/__init__.py:648: in init_test_database
    init_config=self.init_config)
.tox/py27/local/lib/python2.7/site-packages/cubicweb/server/__init__.py:218: in init_repository
    repo.bootstrap()
.tox/py27/local/lib/python2.7/site-packages/cubicweb/server/repository.py:276: in bootstrap
    self.set_schema(config.load_schema(expand_cubes=True))
.tox/py27/local/lib/python2.7/site-packages/cubicweb/server/repository.py:362: in set_schema
    self.vreg.set_schema(schema)
.tox/py27/local/lib/python2.7/site-packages/cubicweb/cwvreg.py:420: in set_schema
    self.reload(self.config.appobjects_modnames(), force_reload=False)
.tox/py27/local/lib/python2.7/site-packages/cubicweb/cwvreg.py:485: in reload
    self.register_modnames(modnames)
.tox/py27/local/lib/python2.7/site-packages/logilab/common/registry.py:713: in register_modnames
    self.load_file(filepath, modname)
.tox/py27/local/lib/python2.7/site-packages/cubicweb/cwvreg.py:495: in load_file
    return super(CWRegistryStore, self).load_file(filepath, modname)
.tox/py27/local/lib/python2.7/site-packages/logilab/common/registry.py:772: in load_file
    self.load_module(module)
.tox/py27/local/lib/python2.7/site-packages/logilab/common/registry.py:795: in load_module
    module.registration_callback(self)
_ _ _ _ _ _ _ _ _ _ _ _ _ _ _ _ _ _ _ _ _ _ _ _ _ _ _ _ _ _ _ _ _ _ _ _ _ _ _ _ 

vreg = {'adapters': {'IRecordable': [<class 'cubes.prov.entities.IRecordable'>], 'EAC...lation': [<class 'cubicweb.hooks.security.BeforeDeleteRelationSecurityHook'>]}}

    def registration_callback(vreg):
        vreg.register_all(globals().values(), __name__)
        vreg.register(IContainer.build_class('SEDAArchiveTransfer'))
        vreg.register(IContainer.build_class('SEDAArchiveUnit'))  # archive unit may also be a container
        for etype, parent_relations in sorted(seda_profile_container_def(vreg.schema)):
            cls = DirectLinkIContained.build_class(etype, parent_relations)
>           assert cls
E           AssertionError

.tox/py27/local/lib/python2.7/site-packages/cubicweb_seda/entities/__init__.py:202: AssertionError
----------------------------- Captured stderr call -----------------------------
building tmpdb failed
_______________________ LCSVImportTC.test_cwuri_with_ark _______________________
.tox/py27/local/lib/python2.7/site-packages/cubicweb/devtools/testlib.py:418: in setUp
    self._init_repo()
.tox/py27/local/lib/python2.7/site-packages/cubicweb/devtools/testlib.py:347: in _init_repo
    db_handler.build_db_cache(self.test_db_id, self.pre_setup_database)
.tox/py27/local/lib/python2.7/site-packages/cubicweb/devtools/__init__.py:475: in build_db_cache
    self.init_test_database()
.tox/py27/local/lib/python2.7/site-packages/cubicweb/devtools/__init__.py:793: in init_test_database
    init_config=self.init_config)
.tox/py27/local/lib/python2.7/site-packages/cubicweb/server/__init__.py:218: in init_repository
    repo.bootstrap()
.tox/py27/local/lib/python2.7/site-packages/cubicweb/server/repository.py:276: in bootstrap
    self.set_schema(config.load_schema(expand_cubes=True))
.tox/py27/local/lib/python2.7/site-packages/cubicweb/server/repository.py:362: in set_schema
    self.vreg.set_schema(schema)
.tox/py27/local/lib/python2.7/site-packages/cubicweb/cwvreg.py:420: in set_schema
    self.reload(self.config.appobjects_modnames(), force_reload=False)
.tox/py27/local/lib/python2.7/site-packages/cubicweb/cwvreg.py:485: in reload
    self.register_modnames(modnames)
.tox/py27/local/lib/python2.7/site-packages/logilab/common/registry.py:713: in register_modnames
    self.load_file(filepath, modname)
.tox/py27/local/lib/python2.7/site-packages/cubicweb/cwvreg.py:495: in load_file
    return super(CWRegistryStore, self).load_file(filepath, modname)
.tox/py27/local/lib/python2.7/site-packages/logilab/common/registry.py:772: in load_file
    self.load_module(module)
.tox/py27/local/lib/python2.7/site-packages/logilab/common/registry.py:795: in load_module
    module.registration_callback(self)
_ _ _ _ _ _ _ _ _ _ _ _ _ _ _ _ _ _ _ _ _ _ _ _ _ _ _ _ _ _ _ _ _ _ _ _ _ _ _ _ 

vreg = {'adapters': {'IRecordable': [<class 'cubes.prov.entities.IRecordable'>], 'EAC...lation': [<class 'cubicweb.hooks.security.BeforeDeleteRelationSecurityHook'>]}}

    def registration_callback(vreg):
        vreg.register_all(globals().values(), __name__)
        vreg.register(IContainer.build_class('SEDAArchiveTransfer'))
        vreg.register(IContainer.build_class('SEDAArchiveUnit'))  # archive unit may also be a container
        for etype, parent_relations in sorted(seda_profile_container_def(vreg.schema)):
            cls = DirectLinkIContained.build_class(etype, parent_relations)
>           assert cls
E           AssertionError

.tox/py27/local/lib/python2.7/site-packages/cubicweb_seda/entities/__init__.py:202: AssertionError
============== 33 failed, 8 passed, 101 skipped in 75.92 seconds ===============
waiting for server to shut down.... done
server stopped
Exception TypeError: "'NoneType' object is not callable" in <bound method PostgresTestDataBaseHandler.__del__ of <cubicweb.devtools.PostgresTestDataBaseHandler object at 0x7f014bafb710>> ignored
ERROR: InvocationError: '<https://jenkins.logilab.org/job/cubicweb-saem_ref/TOXENV=py27,distributions=debian_jessie/ws/.tox/py27/bin/python> -m pytest <https://jenkins.logilab.org/job/cubicweb-saem_ref/TOXENV=py27,distributions=debian_jessie/ws/test'>
___________________________________ summary ____________________________________
ERROR:   py27: commands failed
Build step 'Execute shell' marked build as failure



More information about the saem-devel mailing list