Build failed in Jenkins: cubicweb-eac » py27,debian_jessie #62

jenkins.logilab.org noreply at logilab.org
Tue Mar 7 15:21:04 CET 2017


https://jenkins.logilab.org/job/cubicweb-eac/TOXENV=py27,distributions=debian_jessie/62/Changes:

[Sylvain Thénault <sylvain.thenault at logilab.fr>] [pkg] i18n update

[Sylvain Thénault <sylvain.thenault at logilab.fr>] [pkg] Prepare 0.4

[Sylvain Thénault <sylvain.thenault at logilab.fr>] [pkg] Fix modname in __pkginfo__

------------------------------------------
Started by upstream project "cubicweb-eac" build number 62
originally caused by:
 Started by an SCM change
Building remotely on docker-slave-4e27c68e75be (debian_jessie) in workspace <https://jenkins.logilab.org/job/cubicweb-eac/TOXENV=py27,distributions=debian_jessie/ws/>
$ hg clone --rev 987ab4937e028c629060c156ec1393f7578d1eb1 --noupdate http://hg.logilab.org/review/cubes/eac <https://jenkins.logilab.org/job/cubicweb-eac/TOXENV=py27,distributions=debian_jessie/ws/>
adding changesets
adding manifests
adding file changes
added 81 changesets with 228 changes to 67 files
[debian_jessie] $ hg update --rev 987ab4937e028c629060c156ec1393f7578d1eb1
51 files updated, 0 files merged, 0 files removed, 0 files unresolved
[debian_jessie] $ hg log --rev . --template {node}
[debian_jessie] $ hg log --rev . --template {rev}
[debian_jessie] $ hg log --rev 26c6e48c28190f9af4b204215b2332edbfe918d4 --template exists\n
exists
[debian_jessie] $ hg log --template "<changeset node='{node}' author='{author|xmlescape}' rev='{rev}' date='{date}'><msg>{desc|xmlescape}</msg><added>{file_adds|stringify|xmlescape}</added><deleted>{file_dels|stringify|xmlescape}</deleted><files>{files|stringify|xmlescape}</files><parents>{parents}</parents></changeset>\n" --rev "ancestors('987ab4937e028c629060c156ec1393f7578d1eb1') and not ancestors(26c6e48c28190f9af4b204215b2332edbfe918d4)" --encoding UTF-8 --encodingmode replace
[debian_jessie] $ /bin/sh -xe /tmp/hudson82722273764983611.sh
+ find . ( -name pgdb* -o -name tmpdb* ) -print0
+ xargs -0 rm -rf
[debian_jessie] $ /bin/sh -xe /tmp/hudson5299611843880362907.sh
+ PATH=/usr/lib/postgresql/9.4/bin:/usr/local/bin:/usr/bin:/bin:/usr/games tox --recreate
GLOB sdist-make: <https://jenkins.logilab.org/job/cubicweb-eac/TOXENV=py27,distributions=debian_jessie/ws/setup.py>
py27 create: <https://jenkins.logilab.org/job/cubicweb-eac/TOXENV=py27,distributions=debian_jessie/ws/.tox/py27>
py27 installdeps: pytest, mock, docutils, http://hg.logilab.org/master/cubes/prov/archive/tip.tar.bz2#egg=cubicweb-prov
py27 inst: <https://jenkins.logilab.org/job/cubicweb-eac/TOXENV=py27,distributions=debian_jessie/ws/.tox/dist/cubicweb-eac-0.4.0.zip>
py27 installed: appdirs==1.4.3,chardet==2.3.0,colorama==0.3.2,cubicweb==3.24.5,cubicweb-addressbook==1.9.1,cubicweb-eac==0.4.0,cubicweb-geocoding==0.2.1,cubicweb-prov==0.3.0,cubicweb-skos==1.1.0,decorator==3.4.0,docutils==0.13.1,funcsigs==1.0.2,GDAL==1.10.1,html2text==2016.9.19,html5lib==0.999,isodate==0.5.0,joblib==0.8.3,linecache2==1.0.0,logilab-common==1.3.0,logilab-constraint==0.6.0,logilab-database==1.15.0,logilab-mtconverter==0.9.0,lxml==3.4.0,Markdown==2.6.8,mercurial==3.9.1,mock==2.0.0,numpy==1.8.2,packaging==16.8,pandas==0.14.1,passlib==1.7.1,pbr==2.0.0,Pillow==2.6.1,pluggy==0.4.0,psycopg2==2.5.4,py==1.4.32,pykerberos==1.1.5,pyparsing==2.2.0,pytest==3.0.6,python-dateutil==2.2,pytz==2012rc0,rdflib==4.1.2,requests==2.4.3,requests-kerberos==0.5,rql==0.34.2,scikit-learn==0.14.1,scipy==0.14.0,six==1.10.0,tox==2.5.0,traceback2==1.4.0,unittest2==1.1.0,urllib3==1.9.1,virtualenv==15.1.0,yams==0.44.1,Yapps2==2.2.0
py27 runtests: PYTHONHASHSEED='2841639958'
py27 runtests: commands[0] | <https://jenkins.logilab.org/job/cubicweb-eac/TOXENV=py27,distributions=debian_jessie/ws/.tox/py27/bin/python> -m pytest test
============================= test session starts ==============================
platform linux2 -- Python 2.7.9, pytest-3.0.6, py-1.4.32, pluggy-0.4.0
rootdir: <https://jenkins.logilab.org/job/cubicweb-eac/TOXENV=py27,distributions=debian_jessie/ws/,> inifile: 
collected 29 items

test/test_dataimport.py ..........
test/test_entities.py ......
test/test_export.py F.
test/test_schema.py ...
test/test_views.py ........

=================================== FAILURES ===================================
___________________ EACExportFunctionalTests.test_roundtrip ____________________

self = <test_export.EACExportFunctionalTests testMethod=test_roundtrip>

    def test_roundtrip(self):
>       self._test('export-roundtrip.rst')

test/test_export.py:37: 
_ _ _ _ _ _ _ _ _ _ _ _ _ _ _ _ _ _ _ _ _ _ _ _ _ _ _ _ _ _ _ _ _ _ _ _ _ _ _ _ 
test/test_export.py:31: in _test
    failure_count, test_count, filename))
E   AssertionError: 1 failures of 6 in export-roundtrip.rst (check report)
----------------------------- Captured stdout call -----------------------------
**********************************************************************
File "<https://jenkins.logilab.org/job/cubicweb-eac/TOXENV=py27,distributions=debian_jessie/ws/test/export-roundtrip.rst",> line 170, in export-roundtrip.rst
Failed example:
    self.assertXmlValid(generated_eac, self.datapath('cpf.xsd'))
Exception raised:
    Traceback (most recent call last):
      File "/usr/lib/python2.7/doctest.py", line 1315, in __run
        compileflags, 1) in test.globs
      File "<doctest export-roundtrip.rst[5]>", line 1, in <module>
        self.assertXmlValid(generated_eac, self.datapath('cpf.xsd'))
      File "cubicweb_eac/testutils.py", line 60, in assertXmlValid
        xmlschema = etree.XMLSchema(etree.parse(xsd))
      File "xmlschema.pxi", line 90, in lxml.etree.XMLSchema.__init__ (src/lxml/lxml.etree.c:175129)
    XMLSchemaParseError: Element '{http://www.w3.org/2001/XMLSchema}attributeGroup', attribute 'ref': The QName value '{http://www.w3.org/1999/xlink}simpleLink' does not resolve to a(n) attribute group definition., line 364
**********************************************************************
1 items had failures:
   1 of   6 in export-roundtrip.rst
***Test Failed*** 1 failures.
===================== 1 failed, 28 passed in 43.45 seconds =====================
ERROR: InvocationError: '<https://jenkins.logilab.org/job/cubicweb-eac/TOXENV=py27,distributions=debian_jessie/ws/.tox/py27/bin/python> -m pytest test'
___________________________________ summary ____________________________________
ERROR:   py27: commands failed
Build step 'Execute shell' marked build as failure



More information about the saem-devel mailing list